Reaction Details
TargetCoagulation factor X
LigandBDBM50096459
Substrate/Competitorn/a
Meas. Tech.ChEBML_226347
Ki 5±n/a nM
Citation Heinelt, UHerok, SMatter, HWildgoose, P Solid-phase optimisation of achiral amidinobenzyl indoles as potent and selective factor Xa inhibitors. Bioorg Med Chem Lett11:227-30 (2001) Coagulation factor X
Name:Coagulation factor X
Type:Enzyme
Mol. Mass.:54726.60
Organism:Homo sapiens (Human)
Description:n/a
Residue:488
BDBM50096459
NameBDBM50096459
Synonyms:1-(3-Carbamimidoyl-benzyl)-4-hydroxy-1H-indole-2-carboxylic acid 3,5-dichloro-benzylamide | CHEMBL75544
TypeSmall organic molecule
Emp. Form.C24H20Cl2N4O2
Mol. Mass.467.347
SMILESNC(=N)c1cccc(Cn2c(cc3c(O)cccc23)C(=O)NCc2cc(Cl)cc(Cl)c2)c1