Reaction Details
TargetProthrombin
LigandBDBM50096623
Substrate/Competitorn/a
Meas. Tech.ChEBML_32965
Ki 0.130000±n/a nM
Citation Bachand, BTarazi, MSt-Denis, YEdmunds, JJWinocour, PDLeblond, LSiddiqui, MA Potent and selective bicyclic lactam inhibitors of thrombin. Part 4: transition state inhibitors. Bioorg Med Chem Lett11:287-90 (2001) Prothrombin
Name:Prothrombin
Type:Protein
Mol. Mass.:70029.57
Organism:Homo sapiens (Human)
Description:P00734
Residue:622
BDBM50096623
NameBDBM50096623
Synonyms:3-(4-Amino-cyclohexyl)-2-oxo-3-[(4-oxo-2-phenylmethanesulfonyl-octahydro-pyrrolo[1,2-a]pyrazine-6-carbonyl)-amino]-propionic acid methyl ester | CHEMBL3084833
TypeSmall organic molecule
Emp. Form.C25H34N4O7S
Mol. Mass.534.625
SMILES[H][C@@]12CC[C@H](N1C(=O)CN(C2)S(=O)(=O)Cc1ccccc1)C(=O)NC([C@H]1CC[C@H](N)CC1)C(=O)C(=O)OC