Reaction Details
TargetMatrix metalloproteinase-9
LigandBDBM50096650
Substrate/Competitorn/a
Meas. Tech.ChEBML_105358
IC50 25±n/a nM
Citation Chollet, AMLe Diguarher, TMurray, LBertrand, MTucker, GCSabatini, MPierré, AAtassi, GBonnet, JCasara, P General synthesis of alpha-substituted 3-bisaryloxy propionic acid derivatives as specific MMP inhibitors. Bioorg Med Chem Lett11:295-9 (2001) Matrix metalloproteinase-9
Name:Matrix metalloproteinase-9
Type:Enzyme
Mol. Mass.:78452.28
Organism:Homo sapiens (Human)
Description:P14780
Residue:707
BDBM50096650
NameBDBM50096650
Synonyms:2-(Biphenyl-4-yloxymethyl)-4-(2,4-dioxo-1,4-dihydro-2H-quinazolin-3-yl)-N-hydroxy-butyramide | CHEMBL100805
TypeSmall organic molecule
Emp. Form.C25H23N3O5
Mol. Mass.445.4672
SMILESONC(=O)C(CCn1c(=O)[nH]c2ccccc2c1=O)COc1ccc(cc1)-c1ccccc1