Reaction Details
TargetMatrix metalloproteinase-9
LigandBDBM50096648
Substrate/Competitorn/a
Meas. Tech.ChEBML_105358
IC50 3.6±n/a nM
Citation Chollet, AMLe Diguarher, TMurray, LBertrand, MTucker, GCSabatini, MPierré, AAtassi, GBonnet, JCasara, P General synthesis of alpha-substituted 3-bisaryloxy propionic acid derivatives as specific MMP inhibitors. Bioorg Med Chem Lett11:295-9 (2001) Matrix metalloproteinase-9
Name:Matrix metalloproteinase-9
Type:Enzyme
Mol. Mass.:78452.28
Organism:Homo sapiens (Human)
Description:P14780
Residue:707
BDBM50096648
NameBDBM50096648
Synonyms:2-[2-(4'-Chloro-biphenyl-4-yl)-ethoxymethyl]-N-hydroxy-4-(4-oxo-4H-benzo[d][1,2,3]triazin-3-yl)-butyramide | CHEMBL100584
TypeSmall organic molecule
Emp. Form.C26H25ClN4O4
Mol. Mass.492.954
SMILESONC(=O)C(CCn1nnc2ccccc2c1=O)COCCc1ccc(cc1)-c1ccc(Cl)cc1