Reaction Details
TargetCollagenase 3
LigandBDBM50096645
Substrate/Competitorn/a
Meas. Tech.ChEBML_106483
IC50 64±n/a nM
Citation Chollet, AMLe Diguarher, TMurray, LBertrand, MTucker, GCSabatini, MPierré, AAtassi, GBonnet, JCasara, P General synthesis of alpha-substituted 3-bisaryloxy propionic acid derivatives as specific MMP inhibitors. Bioorg Med Chem Lett11:295-9 (2001) Collagenase 3
Name:Collagenase 3
Type:Enzyme
Mol. Mass.:53808.06
Organism:Homo sapiens (Human)
Description:P45452
Residue:471
BDBM50096645
NameBDBM50096645
Synonyms:3-(4'-Cyano-biphenyl-4-yloxy)-N-hydroxy-propionamide 3-[(4'-cyanobiphenyl-4-yl)oxy]-N-hydroxypropanamide | CHEMBL38851
TypeSmall organic molecule
Emp. Form.C16H14N2O3
Mol. Mass.282.294
SMILESONC(=O)CCOc1ccc(cc1)-c1ccc(cc1)C#N