Reaction Details
Target72 kDa type IV collagenase
LigandBDBM50096644
Substrate/Competitorn/a
Meas. Tech.ChEBML_104377
IC50 6±n/a nM
Citation Chollet, AMLe Diguarher, TMurray, LBertrand, MTucker, GCSabatini, MPierré, AAtassi, GBonnet, JCasara, P General synthesis of alpha-substituted 3-bisaryloxy propionic acid derivatives as specific MMP inhibitors. Bioorg Med Chem Lett11:295-9 (2001) 72 kDa type IV collagenase
Name:72 kDa type IV collagenase
Type:Enzyme
Mol. Mass.:73870.36
Organism:Homo sapiens (Human)
Description: P08253
Residue:660
BDBM50096644
NameBDBM50096644
Synonyms:2-(Biphenyl-4-yloxymethyl)-N-hydroxy-4-(1-oxo-1H-phthalazin-2-yl)-butyramide | CHEMBL102459
TypeSmall organic molecule
Emp. Form.C25H23N3O4
Mol. Mass.429.4678
SMILESONC(=O)C(CCn1ncc2ccccc2c1=O)COc1ccc(cc1)-c1ccccc1