Reaction Details
TargetStromelysin-1
LigandBDBM50096643
Substrate/Competitorn/a
Meas. Tech.ChEBML_104720
IC50 23±n/a nM
Citation Chollet, AMLe Diguarher, TMurray, LBertrand, MTucker, GCSabatini, MPierré, AAtassi, GBonnet, JCasara, P General synthesis of alpha-substituted 3-bisaryloxy propionic acid derivatives as specific MMP inhibitors. Bioorg Med Chem Lett11:295-9 (2001) Stromelysin-1
Name:Stromelysin-1
Type:Enzyme
Mol. Mass.:53973.13
Organism:Homo sapiens (Human)
Description: P08254
Residue:477
BDBM50096643
NameBDBM50096643
Synonyms:2-(Biphenyl-4-yloxymethyl)-N-hydroxy-4-(1,1,3-trioxo-1,3-dihydro-1lambda*6*-benzo[d]isothiazol-2-yl)-butyramide | CHEMBL103442
TypeSmall organic molecule
Emp. Form.C24H22N2O6S
Mol. Mass.466.506
SMILESONC(=O)C(CCN1C(=O)c2ccccc2S1(=O)=O)COc1ccc(cc1)-c1ccccc1