Reaction Details
Target72 kDa type IV collagenase
LigandBDBM50096652
Substrate/Competitorn/a
Meas. Tech.ChEBML_104377
IC50 36±n/a nM
Citation Chollet, AMLe Diguarher, TMurray, LBertrand, MTucker, GCSabatini, MPierré, AAtassi, GBonnet, JCasara, P General synthesis of alpha-substituted 3-bisaryloxy propionic acid derivatives as specific MMP inhibitors. Bioorg Med Chem Lett11:295-9 (2001) 72 kDa type IV collagenase
Name:72 kDa type IV collagenase
Type:Enzyme
Mol. Mass.:73870.36
Organism:Homo sapiens (Human)
Description: P08253
Residue:660
BDBM50096652
NameBDBM50096652
Synonyms:2-(Biphenyl-4-yloxymethyl)-N-hydroxy-4-(3,4,4-trimethyl-2,5-dioxo-imidazolidin-1-yl)-butyramide | CHEMBL323148
TypeSmall organic molecule
Emp. Form.C23H27N3O5
Mol. Mass.425.4776
SMILESCN1C(=O)N(CCC(COc2ccc(cc2)-c2ccccc2)C(=O)NO)C(=O)C1(C)C