Reaction Details
Target72 kDa type IV collagenase
LigandBDBM50096647
Substrate/Competitorn/a
Meas. Tech.ChEBML_104377
IC50 3±n/a nM
Citation Chollet, AMLe Diguarher, TMurray, LBertrand, MTucker, GCSabatini, MPierré, AAtassi, GBonnet, JCasara, P General synthesis of alpha-substituted 3-bisaryloxy propionic acid derivatives as specific MMP inhibitors. Bioorg Med Chem Lett11:295-9 (2001) 72 kDa type IV collagenase
Name:72 kDa type IV collagenase
Type:Enzyme
Mol. Mass.:73870.36
Organism:Homo sapiens (Human)
Description: P08253
Residue:660
BDBM50096647
NameBDBM50096647
Synonyms:2-(Biphenyl-4-yloxymethyl)-4-(1,3-dioxo-1,3-dihydro-isoindol-2-yl)-N-hydroxy-butyramide | CHEMBL101121
TypeSmall organic molecule
Emp. Form.C25H22N2O5
Mol. Mass.430.4526
SMILESONC(=O)C(CCN1C(=O)c2ccccc2C1=O)COc1ccc(cc1)-c1ccccc1