Reaction Details
TargetCollagenase 3
LigandBDBM50096646
Substrate/Competitorn/a
Meas. Tech.ChEBML_106483
IC50 0.016000±n/a nM
Citation Chollet, AMLe Diguarher, TMurray, LBertrand, MTucker, GCSabatini, MPierré, AAtassi, GBonnet, JCasara, P General synthesis of alpha-substituted 3-bisaryloxy propionic acid derivatives as specific MMP inhibitors. Bioorg Med Chem Lett11:295-9 (2001) Collagenase 3
Name:Collagenase 3
Type:Enzyme
Mol. Mass.:53808.06
Organism:Homo sapiens (Human)
Description:P45452
Residue:471
BDBM50096646
NameBDBM50096646
Synonyms:2-(4'-Chloro-biphenyl-4-yloxymethyl)-N-hydroxy-4-(4-oxo-4H-benzo[d][1,2,3]triazin-3-yl)-butyramide | CHEMBL317132
TypeSmall organic molecule
Emp. Form.C24H21ClN4O4
Mol. Mass.464.901
SMILESONC(=O)C(CCn1nnc2ccccc2c1=O)COc1ccc(cc1)-c1ccc(Cl)cc1