Reaction Details
TargetDelta-type opioid receptor
LigandBDBM50096715
Substrate/Competitorn/a
Meas. Tech.ChEBML_147344
Ki 12±n/a nM
Citation Lu, YWeltrowska, GLemieux, CChung, NNSchiller, PW Stereospecific synthesis of (2S)-2-methyl-3-(2',6'-dimethyl-4'-hydroxyphenyl)-propionic acid (Mdp) and its incorporation into an opioid peptide. Bioorg Med Chem Lett11:323-5 (2001) Delta-type opioid receptor
Name:Delta-type opioid receptor
Type:G Protein-Coupled Receptor (GPCR)
Mol. Mass.:40382.98
Organism:Homo sapiens (Human)
Description:Competition binding assays were carried out using membrane preparations from transfected HN9.10 cells that constitutively expressed the delta opioid receptor.
Residue:372
BDBM50096715
NameBDBM50096715
Synonyms:(S)-2-[(S)-2-(2-{(S)-2-[(S)-3-(4-Hydroxy-2,6-dimethyl-phenyl)-2-methyl-propionylamino]-propionylamino}-acetylamino)-3-phenyl-propionylamino]-4-methyl-pentanoic acid amide | CHEMBL109659
TypeSmall organic molecule
Emp. Form.C32H45N5O6
Mol. Mass.595.7296
SMILESCC(C)C[C@H](NC(=O)[C@H](Cc1ccccc1)NC(=O)CNC(=O)[C@H](C)NC(=O)[C@@H](C)Cc1c(C)cc(O)cc1C)C(N)=O