Reaction Details
TargetMu-type opioid receptor
LigandBDBM50001465
Substrate/Competitorn/a
Meas. Tech.ChEBML_149328
Ki 9.4±n/a nM
Citation Lu, YWeltrowska, GLemieux, CChung, NNSchiller, PW Stereospecific synthesis of (2S)-2-methyl-3-(2',6'-dimethyl-4'-hydroxyphenyl)-propionic acid (Mdp) and its incorporation into an opioid peptide. Bioorg Med Chem Lett11:323-5 (2001) Mu-type opioid receptor
Name:Mu-type opioid receptor
Type:G Protein-Coupled Receptor (GPCR)
Mol. Mass.:44789.51
Organism:Homo sapiens (Human)
Description:P35372
Residue:400
BDBM50001465
NameBDBM50001465
Synonyms:(S)-2-[(S)-2-(2-{2-[(S)-2-Amino-3-(4-hydroxy-phenyl)-propionylamino]-acetylamino}-acetylamino)-3-phenyl-propionylamino]-4-methyl-pentanoic acid (enkephalin)2-[2-(2-{2-[2-Amino-3-(4-hydroxy-phenyl)-propionylamino]-acetylamino}-acetylamino)-3-phenyl-propionylamino]-4-methyl-pentanoic acid 2-[(S)-2-(2-{2-[(S)-2-Amino-3-(4-hydroxy-phenyl)-propionylamino]-acetylamino}-acetylamino)-3-phenyl-propionylamino]-4-methyl-pentanoic acid 2-[2-(2-{2-[2-Amino-3-(4-hydroxy-phenyl)-propionylamino]-acetylamino}-acetylamino)-3-phenyl-propionylamino]-4-methyl-pentanoic acid 2-{1-[1-amino-2-(4-hydroxyphenyl)ethylcarboxamidomethylcarboxamidomethylcarboxamido]-2-phenylethylcarboxamido}-4-methylpentanoic acid ENKEPHALIN Leu5-Enkephalin | Tyr-Gly-Gly-Phe-Leu-OH
TypeSmall organic molecule
Emp. Form.C28H37N5O7
Mol. Mass.555.6227
SMILESCC(C)C[C@H](NC(=O)[C@H](Cc1ccccc1)NC(=O)CNC(=O)CNC(=O)[C@@H](N)Cc1ccc(O)cc1)C(O)=O