Reaction Details
TargetKappa-type opioid receptor
LigandBDBM50096715
Substrate/Competitorn/a
Meas. Tech.ChEBML_145963
Ki>10000±n/a nM
Citation Lu, YWeltrowska, GLemieux, CChung, NNSchiller, PW Stereospecific synthesis of (2S)-2-methyl-3-(2',6'-dimethyl-4'-hydroxyphenyl)-propionic acid (Mdp) and its incorporation into an opioid peptide. Bioorg Med Chem Lett11:323-5 (2001) Kappa-type opioid receptor
Name:Kappa-type opioid receptor
Type:G Protein-Coupled Receptor (GPCR)
Mol. Mass.:42648.76
Organism:Homo sapiens (Human)
Description:P41145
Residue:380
BDBM50096715
NameBDBM50096715
Synonyms:(S)-2-[(S)-2-(2-{(S)-2-[(S)-3-(4-Hydroxy-2,6-dimethyl-phenyl)-2-methyl-propionylamino]-propionylamino}-acetylamino)-3-phenyl-propionylamino]-4-methyl-pentanoic acid amide | CHEMBL109659
TypeSmall organic molecule
Emp. Form.C32H45N5O6
Mol. Mass.595.7296
SMILESCC(C)C[C@H](NC(=O)[C@H](Cc1ccccc1)NC(=O)CNC(=O)[C@H](C)NC(=O)[C@@H](C)Cc1c(C)cc(O)cc1C)C(N)=O