Reaction Details
TargetBeta-2 adrenergic receptor
LigandBDBM50096783
Substrate/Competitorn/a
Meas. Tech.ChEBML_38307
IC50 370±n/a nM
Citation Brockunier, LLCandelore, MRCascieri, MALiu, YTota, LWyvratt, MJFisher, MHWeber, AEParmee, ER Human beta3 adrenergic receptor agonists containing cyanoguanidine and nitroethylenediamine moieties. Bioorg Med Chem Lett11:379-82 (2001) Beta-2 adrenergic receptor
Name:Beta-2 adrenergic receptor
Type:n/a
Mol. Mass.:46461.69
Organism:Homo sapiens (Human)
Description:P07550
Residue:413
BDBM50096783
NameBDBM50096783
Synonyms:(R)-2-(2-{4-[1-(Naphthalen-1-ylamino)-2-nitro-vinylamino]-phenyl}-ethylamino)-1-pyridin-3-yl-ethanol | CHEMBL338748
TypeSmall organic molecule
Emp. Form.C27H27N5O3
Mol. Mass.469.535
SMILESOC(CNCCc1ccc(N\C([CH-][N+]([O-])=O)=[NH+]\c2cccc3ccccc23)cc1)c1cccnc1