Reaction Details
TargetBeta-2 adrenergic receptor
LigandBDBM50096768
Substrate/Competitorn/a
Meas. Tech.ChEBML_38307
IC50>10000±n/a nM
Citation Brockunier, LLCandelore, MRCascieri, MALiu, YTota, LWyvratt, MJFisher, MHWeber, AEParmee, ER Human beta3 adrenergic receptor agonists containing cyanoguanidine and nitroethylenediamine moieties. Bioorg Med Chem Lett11:379-82 (2001) Beta-2 adrenergic receptor
Name:Beta-2 adrenergic receptor
Type:n/a
Mol. Mass.:46461.69
Organism:Homo sapiens (Human)
Description:P07550
Residue:413
BDBM50096768
NameBDBM50096768
Synonyms:CHEMBL120238 | Cyanoguanidine derivative
TypeSmall organic molecule
Emp. Form.C35H31F3N8O2S
Mol. Mass.684.733
SMILESO[C@@H](CNCCc1ccc(NC(Nc2cccc3N(CCc23)c2nc(cs2)-c2ccc(OC(F)(F)F)cc2)=NC#N)cc1)c1cccnc1