Reaction Details
TargetBeta-2 adrenergic receptor
LigandBDBM50096767
Substrate/Competitorn/a
Meas. Tech.ChEBML_38307
IC50 1200±n/a nM
Citation Brockunier, LLCandelore, MRCascieri, MALiu, YTota, LWyvratt, MJFisher, MHWeber, AEParmee, ER Human beta3 adrenergic receptor agonists containing cyanoguanidine and nitroethylenediamine moieties. Bioorg Med Chem Lett11:379-82 (2001) Beta-2 adrenergic receptor
Name:Beta-2 adrenergic receptor
Type:n/a
Mol. Mass.:46461.69
Organism:Homo sapiens (Human)
Description:P07550
Residue:413
BDBM50096767
NameBDBM50096767
Synonyms:3-(1-{4-[2-((R)-2-Hydroxy-2-pyridin-3-yl-ethylamino)-ethyl]-phenylamino}-2-nitro-vinylamino)-benzamide | CHEMBL127451
TypeSmall organic molecule
Emp. Form.C24H26N6O4
Mol. Mass.462.501
SMILESNC(=O)c1cccc(c1)\[NH+]=C(/[CH-][N+]([O-])=O)Nc1ccc(CCNCC(O)c2cccnc2)cc1