Reaction Details
TargetBeta-2 adrenergic receptor
LigandBDBM50096765
Substrate/Competitorn/a
Meas. Tech.ChEBML_38307
IC50 5600±n/a nM
Citation Brockunier, LLCandelore, MRCascieri, MALiu, YTota, LWyvratt, MJFisher, MHWeber, AEParmee, ER Human beta3 adrenergic receptor agonists containing cyanoguanidine and nitroethylenediamine moieties. Bioorg Med Chem Lett11:379-82 (2001) Beta-2 adrenergic receptor
Name:Beta-2 adrenergic receptor
Type:n/a
Mol. Mass.:46461.69
Organism:Homo sapiens (Human)
Description:P07550
Residue:413
BDBM50096765
NameBDBM50096765
Synonyms:(R)-2-(2-{4-[1-(3,5-Dichloro-phenylamino)-2-nitro-vinylamino]-phenyl}-ethylamino)-1-pyridin-3-yl-ethanol | CHEMBL125246
TypeSmall organic molecule
Emp. Form.C23H23Cl2N5O3
Mol. Mass.488.366
SMILESOC(CNCCc1ccc(N\C([CH-][N+]([O-])=O)=[NH+]\c2cc(Cl)cc(Cl)c2)cc1)c1cccnc1