Reaction Details
TargetBeta-2 adrenergic receptor
LigandBDBM50096766
Substrate/Competitorn/a
Meas. Tech.ChEBML_38307
IC50 220±n/a nM
Citation Brockunier, LLCandelore, MRCascieri, MALiu, YTota, LWyvratt, MJFisher, MHWeber, AEParmee, ER Human beta3 adrenergic receptor agonists containing cyanoguanidine and nitroethylenediamine moieties. Bioorg Med Chem Lett11:379-82 (2001) Beta-2 adrenergic receptor
Name:Beta-2 adrenergic receptor
Type:n/a
Mol. Mass.:46461.69
Organism:Homo sapiens (Human)
Description:P07550
Residue:413
BDBM50096766
NameBDBM50096766
Synonyms:(R)-2-(2-{4-[2-Nitro-1-(3-phenoxy-phenylamino)-vinylamino]-phenyl}-ethylamino)-1-pyridin-3-yl-ethanol | CHEMBL419787
TypeSmall organic molecule
Emp. Form.C29H29N5O4
Mol. Mass.511.5717
SMILESOC(CNCCc1ccc(N\C([CH-][N+]([O-])=O)=[NH+]\c2cccc(Oc3ccccc3)c2)cc1)c1cccnc1