Reaction Details
TargetBeta-2 adrenergic receptor
LigandBDBM50096762
Substrate/Competitorn/a
Meas. Tech.ChEBML_38307
IC50 140±n/a nM
Citation Brockunier, LLCandelore, MRCascieri, MALiu, YTota, LWyvratt, MJFisher, MHWeber, AEParmee, ER Human beta3 adrenergic receptor agonists containing cyanoguanidine and nitroethylenediamine moieties. Bioorg Med Chem Lett11:379-82 (2001) Beta-2 adrenergic receptor
Name:Beta-2 adrenergic receptor
Type:n/a
Mol. Mass.:46461.69
Organism:Homo sapiens (Human)
Description:P07550
Residue:413
BDBM50096762
NameBDBM50096762
Synonyms:CHEMBL338618 | Cyanoguanidine derivative
TypeSmall organic molecule
Emp. Form.C23H22Cl2N6O
Mol. Mass.469.366
SMILESO[C@@H](CNCCc1ccc(NC(Nc2cc(Cl)cc(Cl)c2)=NC#N)cc1)c1cccnc1