Reaction Details
TargetBeta-2 adrenergic receptor
LigandBDBM50096777
Substrate/Competitorn/a
Meas. Tech.ChEBML_38307
IC50 50±n/a nM
Citation Brockunier, LLCandelore, MRCascieri, MALiu, YTota, LWyvratt, MJFisher, MHWeber, AEParmee, ER Human beta3 adrenergic receptor agonists containing cyanoguanidine and nitroethylenediamine moieties. Bioorg Med Chem Lett11:379-82 (2001) Beta-2 adrenergic receptor
Name:Beta-2 adrenergic receptor
Type:n/a
Mol. Mass.:46461.69
Organism:Homo sapiens (Human)
Description:P07550
Residue:413
BDBM50096777
NameBDBM50096777
Synonyms:CHEMBL127422 | Cyanoguanidine derivative
TypeSmall organic molecule
Emp. Form.C27H26N6O
Mol. Mass.450.5349
SMILESO[C@@H](CNCCc1ccc(NC(Nc2ccc3ccccc3c2)=NC#N)cc1)c1cccnc1