Reaction Details
TargetBeta-1 adrenergic receptor
LigandBDBM50096775
Substrate/Competitorn/a
Meas. Tech.ChEMBL_37246 (CHEMBL651567)
EC50 41±n/a nM
Citation Brockunier, LLCandelore, MRCascieri, MALiu, YTota, LWyvratt, MJFisher, MHWeber, AEParmee, ER Human beta3 adrenergic receptor agonists containing cyanoguanidine and nitroethylenediamine moieties. Bioorg Med Chem Lett11:379-82 (2001) Beta-1 adrenergic receptor
Name:Beta-1 adrenergic receptor
Type:G Protein-Coupled Receptor (GPCR)
Mol. Mass.:51338.40
Organism:Homo sapiens (Human)
Description:P08588
Residue:477
BDBM50096775
NameBDBM50096775
Synonyms:CHEMBL431678 | Cyanoguanidine derivative
TypeSmall organic molecule
Emp. Form.C35H31F3N8O2S
Mol. Mass.684.733
SMILESO[C@@H](CNCCc1ccc(NC(Nc2ccc3N(CCc3c2)c2nc(cs2)-c2ccc(OC(F)(F)F)cc2)=NC#N)cc1)c1cccnc1