Reaction Details
TargetBeta-3 adrenergic receptor
LigandBDBM50096761
Substrate/Competitorn/a
Meas. Tech.ChEBML_38797
EC50 22±n/a nM
Citation Brockunier, LLCandelore, MRCascieri, MALiu, YTota, LWyvratt, MJFisher, MHWeber, AEParmee, ER Human beta3 adrenergic receptor agonists containing cyanoguanidine and nitroethylenediamine moieties. Bioorg Med Chem Lett11:379-82 (2001) Beta-3 adrenergic receptor
Name:Beta-3 adrenergic receptor
Type:G Protein-Coupled Receptor (GPCR)
Mol. Mass.:43534.88
Organism:Homo sapiens (Human)
Description:n/a
Residue:408
BDBM50096761
NameBDBM50096761
Synonyms:(R)-2-(2-{4-[1-(3-Iodo-phenylamino)-2-nitro-vinylamino]-phenyl}-ethylamino)-1-pyridin-3-yl-ethanol | CHEMBL127428
TypeSmall organic molecule
Emp. Form.C23H24IN5O3
Mol. Mass.545.3728
SMILESOC(CNCCc1ccc(N\C([CH-][N+]([O-])=O)=[NH+]\c2cccc(I)c2)cc1)c1cccnc1