Reaction Details
TargetBeta-3 adrenergic receptor
LigandBDBM50096763
Substrate/Competitorn/a
Meas. Tech.ChEBML_38797
EC50 100±n/a nM
Citation Brockunier, LLCandelore, MRCascieri, MALiu, YTota, LWyvratt, MJFisher, MHWeber, AEParmee, ER Human beta3 adrenergic receptor agonists containing cyanoguanidine and nitroethylenediamine moieties. Bioorg Med Chem Lett11:379-82 (2001) Beta-3 adrenergic receptor
Name:Beta-3 adrenergic receptor
Type:G Protein-Coupled Receptor (GPCR)
Mol. Mass.:43534.88
Organism:Homo sapiens (Human)
Description:n/a
Residue:408
BDBM50096763
NameBDBM50096763
Synonyms:CHEMBL124668 | Cyanoguanidine derivative
TypeSmall organic molecule
Emp. Form.C23H23FN6O
Mol. Mass.418.4667
SMILESO[C@@H](CNCCc1ccc(NC(Nc2cccc(F)c2)=NC#N)cc1)c1cccnc1