Reaction Details
TargetBeta-3 adrenergic receptor
LigandBDBM50096764
Substrate/Competitorn/a
Meas. Tech.ChEBML_38797
EC50 13±n/a nM
Citation Brockunier, LLCandelore, MRCascieri, MALiu, YTota, LWyvratt, MJFisher, MHWeber, AEParmee, ER Human beta3 adrenergic receptor agonists containing cyanoguanidine and nitroethylenediamine moieties. Bioorg Med Chem Lett11:379-82 (2001) Beta-3 adrenergic receptor
Name:Beta-3 adrenergic receptor
Type:G Protein-Coupled Receptor (GPCR)
Mol. Mass.:43534.88
Organism:Homo sapiens (Human)
Description:n/a
Residue:408
BDBM50096764
NameBDBM50096764
Synonyms:CHEMBL127656 | Cyanoguanidine derivative
TypeSmall organic molecule
Emp. Form.C36H44N8OS
Mol. Mass.636.853
SMILESCCCCCCCCc1csc(n1)N1CCc2c1cccc2NC(Nc1ccc(CCNC[C@H](O)c2cccnc2)cc1)=NC#N