Reaction Details
TargetBeta-3 adrenergic receptor
LigandBDBM50096773
Substrate/Competitorn/a
Meas. Tech.ChEBML_38797
EC50 59±n/a nM
Citation Brockunier, LLCandelore, MRCascieri, MALiu, YTota, LWyvratt, MJFisher, MHWeber, AEParmee, ER Human beta3 adrenergic receptor agonists containing cyanoguanidine and nitroethylenediamine moieties. Bioorg Med Chem Lett11:379-82 (2001) Beta-3 adrenergic receptor
Name:Beta-3 adrenergic receptor
Type:G Protein-Coupled Receptor (GPCR)
Mol. Mass.:43534.88
Organism:Homo sapiens (Human)
Description:n/a
Residue:408
BDBM50096773
NameBDBM50096773
Synonyms:CHEMBL124929 | Cyanoguanidine derivative
TypeSmall organic molecule
Emp. Form.C36H44N8OS
Mol. Mass.636.853
SMILESCCCCCCCCc1csc(n1)N1CCc2ccc(NC(Nc3ccc(CCNC[C@H](O)c4cccnc4)cc3)=NC#N)cc12