Reaction Details
TargetBeta-3 adrenergic receptor
LigandBDBM50096766
Substrate/Competitorn/a
Meas. Tech.ChEBML_38797
EC50 120±n/a nM
Citation Brockunier, LLCandelore, MRCascieri, MALiu, YTota, LWyvratt, MJFisher, MHWeber, AEParmee, ER Human beta3 adrenergic receptor agonists containing cyanoguanidine and nitroethylenediamine moieties. Bioorg Med Chem Lett11:379-82 (2001) Beta-3 adrenergic receptor
Name:Beta-3 adrenergic receptor
Type:G Protein-Coupled Receptor (GPCR)
Mol. Mass.:43534.88
Organism:Homo sapiens (Human)
Description:n/a
Residue:408
BDBM50096766
NameBDBM50096766
Synonyms:(R)-2-(2-{4-[2-Nitro-1-(3-phenoxy-phenylamino)-vinylamino]-phenyl}-ethylamino)-1-pyridin-3-yl-ethanol | CHEMBL419787
TypeSmall organic molecule
Emp. Form.C29H29N5O4
Mol. Mass.511.5717
SMILESOC(CNCCc1ccc(N\C([CH-][N+]([O-])=O)=[NH+]\c2cccc(Oc3ccccc3)c2)cc1)c1cccnc1