Reaction Details
TargetBeta-1 adrenergic receptor
LigandBDBM50096778
Substrate/Competitorn/a
Meas. Tech.ChEBML_37246
IC50 110±n/a nM
Citation Brockunier, LLCandelore, MRCascieri, MALiu, YTota, LWyvratt, MJFisher, MHWeber, AEParmee, ER Human beta3 adrenergic receptor agonists containing cyanoguanidine and nitroethylenediamine moieties. Bioorg Med Chem Lett11:379-82 (2001) Beta-1 adrenergic receptor
Name:Beta-1 adrenergic receptor
Type:G Protein-Coupled Receptor (GPCR)
Mol. Mass.:51338.40
Organism:Homo sapiens (Human)
Description:P08588
Residue:477
BDBM50096778
NameBDBM50096778
Synonyms:1-{4-[2-((R)-2-Hydroxy-2-pyridin-3-yl-ethylamino)-ethyl]-phenyl}-3-[1-(4-octyl-thiazol-2-yl)-2,3-dihydro-1H-indol-5-yl]-thiourea | CHEMBL338664
TypeSmall organic molecule
Emp. Form.C35H44N6OS2
Mol. Mass.628.893
SMILESCCCCCCCCc1csc(n1)N1CCc2cc(NC(=S)Nc3ccc(CCNC[C@H](O)c4cccnc4)cc3)ccc12