Reaction Details
TargetBeta-3 adrenergic receptor
LigandBDBM50096770
Substrate/Competitorn/a
Meas. Tech.ChEBML_38797
EC50 19±n/a nM
Citation Brockunier, LLCandelore, MRCascieri, MALiu, YTota, LWyvratt, MJFisher, MHWeber, AEParmee, ER Human beta3 adrenergic receptor agonists containing cyanoguanidine and nitroethylenediamine moieties. Bioorg Med Chem Lett11:379-82 (2001) Beta-3 adrenergic receptor
Name:Beta-3 adrenergic receptor
Type:G Protein-Coupled Receptor (GPCR)
Mol. Mass.:43534.88
Organism:Homo sapiens (Human)
Description:n/a
Residue:408
BDBM50096770
NameBDBM50096770
Synonyms:CHEMBL124597 | Cyanoguanidine derivative
TypeSmall organic molecule
Emp. Form.C39H33F3N8O2S
Mol. Mass.734.792
SMILESO[C@@H](CNCCc1ccc2cc(NC(Nc3ccc4N(CCc4c3)c3nc(cs3)-c3ccc(OC(F)(F)F)cc3)=NC#N)ccc2c1)c1cccnc1