Reaction Details
TargetBeta-1 adrenergic receptor
LigandBDBM50096767
Substrate/Competitorn/a
Meas. Tech.ChEBML_37246
IC50 790±n/a nM
Citation Brockunier, LLCandelore, MRCascieri, MALiu, YTota, LWyvratt, MJFisher, MHWeber, AEParmee, ER Human beta3 adrenergic receptor agonists containing cyanoguanidine and nitroethylenediamine moieties. Bioorg Med Chem Lett11:379-82 (2001) Beta-1 adrenergic receptor
Name:Beta-1 adrenergic receptor
Type:G Protein-Coupled Receptor (GPCR)
Mol. Mass.:51338.40
Organism:Homo sapiens (Human)
Description:P08588
Residue:477
BDBM50096767
NameBDBM50096767
Synonyms:3-(1-{4-[2-((R)-2-Hydroxy-2-pyridin-3-yl-ethylamino)-ethyl]-phenylamino}-2-nitro-vinylamino)-benzamide | CHEMBL127451
TypeSmall organic molecule
Emp. Form.C24H26N6O4
Mol. Mass.462.501
SMILESNC(=O)c1cccc(c1)\[NH+]=C(/[CH-][N+]([O-])=O)Nc1ccc(CCNCC(O)c2cccnc2)cc1