Reaction Details
TargetBeta-1 adrenergic receptor
LigandBDBM50096780
Substrate/Competitorn/a
Meas. Tech.ChEBML_37246
IC50 2500±n/a nM
Citation Brockunier, LLCandelore, MRCascieri, MALiu, YTota, LWyvratt, MJFisher, MHWeber, AEParmee, ER Human beta3 adrenergic receptor agonists containing cyanoguanidine and nitroethylenediamine moieties. Bioorg Med Chem Lett11:379-82 (2001) Beta-1 adrenergic receptor
Name:Beta-1 adrenergic receptor
Type:G Protein-Coupled Receptor (GPCR)
Mol. Mass.:51338.40
Organism:Homo sapiens (Human)
Description:P08588
Residue:477
BDBM50096780
NameBDBM50096780
Synonyms:1-(4-Octyl-thiazol-2-yl)-2,3-dihydro-1H-indole-5-sulfonic acid {4-[2-((R)-2-hydroxy-2-pyridin-3-yl-ethylamino)-ethyl]-phenyl}-amide CHEMBL301231
TypeSmall organic molecule
Emp. Form.C34H43N5O3S2
Mol. Mass.633.867
SMILESCCCCCCCCc1csc(n1)N1CCc2cc(ccc12)S(=O)(=O)Nc1ccc(CCNC[C@H](O)c2cccnc2)cc1