Reaction Details
TargetBeta-1 adrenergic receptor
LigandBDBM50096776
Substrate/Competitorn/a
Meas. Tech.ChEBML_37246
IC50 3000±n/a nM
Citation Brockunier, LLCandelore, MRCascieri, MALiu, YTota, LWyvratt, MJFisher, MHWeber, AEParmee, ER Human beta3 adrenergic receptor agonists containing cyanoguanidine and nitroethylenediamine moieties. Bioorg Med Chem Lett11:379-82 (2001) Beta-1 adrenergic receptor
Name:Beta-1 adrenergic receptor
Type:G Protein-Coupled Receptor (GPCR)
Mol. Mass.:51338.40
Organism:Homo sapiens (Human)
Description:P08588
Residue:477
BDBM50096776
NameBDBM50096776
Synonyms:(R)-2-(2-{4-[1-(3-Fluoro-phenylamino)-2-nitro-vinylamino]-phenyl}-ethylamino)-1-pyridin-3-yl-ethanol | CHEMBL124584
TypeSmall organic molecule
Emp. Form.C23H24FN5O3
Mol. Mass.437.4668
SMILESOC(CNCCc1ccc(N\C([CH-][N+]([O-])=O)=[NH+]\c2cccc(F)c2)cc1)c1cccnc1