Reaction Details
TargetBeta-3 adrenergic receptor
LigandBDBM50096784
Substrate/Competitorn/a
Meas. Tech.ChEBML_38797
EC50 150±n/a nM
Citation Brockunier, LLCandelore, MRCascieri, MALiu, YTota, LWyvratt, MJFisher, MHWeber, AEParmee, ER Human beta3 adrenergic receptor agonists containing cyanoguanidine and nitroethylenediamine moieties. Bioorg Med Chem Lett11:379-82 (2001) Beta-3 adrenergic receptor
Name:Beta-3 adrenergic receptor
Type:G Protein-Coupled Receptor (GPCR)
Mol. Mass.:43534.88
Organism:Homo sapiens (Human)
Description:n/a
Residue:408
BDBM50096784
NameBDBM50096784
Synonyms:CHEMBL332010 | Cyanoguanidine derivative
TypeSmall organic molecule
Emp. Form.C24H25N7O2
Mol. Mass.443.501
SMILESNC(=O)c1cccc(NC(Nc2ccc(CCNC[C@H](O)c3cccnc3)cc2)=NC#N)c1