Reaction Details
TargetBeta-3 adrenergic receptor
LigandBDBM50096771
Substrate/Competitorn/a
Meas. Tech.ChEBML_38797
EC50 100±n/a nM
Citation Brockunier, LLCandelore, MRCascieri, MALiu, YTota, LWyvratt, MJFisher, MHWeber, AEParmee, ER Human beta3 adrenergic receptor agonists containing cyanoguanidine and nitroethylenediamine moieties. Bioorg Med Chem Lett11:379-82 (2001) Beta-3 adrenergic receptor
Name:Beta-3 adrenergic receptor
Type:G Protein-Coupled Receptor (GPCR)
Mol. Mass.:43534.88
Organism:Homo sapiens (Human)
Description:n/a
Residue:408
BDBM50096771
NameBDBM50096771
Synonyms:CHEMBL126055 | Cyanoguanidine derivative
TypeSmall organic molecule
Emp. Form.C23H23IN6O
Mol. Mass.526.3728
SMILESO[C@@H](CNCCc1ccc(NC(Nc2ccc(I)cc2)=NC#N)cc1)c1cccnc1