Reaction Details
TargetBeta-1 adrenergic receptor
LigandBDBM50096782
Substrate/Competitorn/a
Meas. Tech.ChEBML_37246
IC50 480±n/a nM
Citation Brockunier, LLCandelore, MRCascieri, MALiu, YTota, LWyvratt, MJFisher, MHWeber, AEParmee, ER Human beta3 adrenergic receptor agonists containing cyanoguanidine and nitroethylenediamine moieties. Bioorg Med Chem Lett11:379-82 (2001) Beta-1 adrenergic receptor
Name:Beta-1 adrenergic receptor
Type:G Protein-Coupled Receptor (GPCR)
Mol. Mass.:51338.40
Organism:Homo sapiens (Human)
Description:P08588
Residue:477
BDBM50096782
NameBDBM50096782
Synonyms:CHEMBL439794 | Cyanoguanidine derivative
TypeSmall organic molecule
Emp. Form.C27H26N6O
Mol. Mass.450.5349
SMILESO[C@@H](CNCCc1ccc(NC(Nc2cccc3ccccc23)=NC#N)cc1)c1cccnc1