Reaction Details
TargetSomatostatin receptor type 2
LigandBDBM50096821
Substrate/Competitorn/a
Meas. Tech.ChEBML_200365
Ki 7.2±n/a nM
Citation Zhou, CGuo, LMorriello, GPasternak, APan, YRohrer, SPBirzin, ETHuskey, SEJacks, TSchleim, KDCheng, KSchaeffer, JMPatchett, AAYang, L Nipecotic and iso-nipecotic amides as potent and selective somatostatin subtype-2 receptor agonists. Bioorg Med Chem Lett11:415-7 (2001) Somatostatin receptor type 2
Name:Somatostatin receptor type 2
Type:Enzyme
Mol. Mass.:41344.94
Organism:Homo sapiens (Human)
Description:P30874
Residue:369
BDBM50096821
NameBDBM50096821
Synonyms:(S)-6-Amino-2-[(S)-2-[(1-cyclohexylcarbamoyl-piperidine-3-carbonyl)-amino]-3-(1H-indol-3-yl)-butyrylamino]-hexanoic acid tert-butyl ester | CHEMBL336308
TypeSmall organic molecule
Emp. Form.C35H54N6O5
Mol. Mass.638.8405
SMILESC[C@H](C(NC(=O)C1CCCN(C1)C(=O)NC1CCCCC1)C(=O)N[C@@H](CCCCN)C(=O)OC(C)(C)C)c1c[nH]c2ccccc12