Reaction Details
TargetSomatostatin receptor type 3
LigandBDBM50096823
Substrate/Competitorn/a
Meas. Tech.ChEBML_200520
Ki 2660±n/a nM
Citation Zhou, CGuo, LMorriello, GPasternak, APan, YRohrer, SPBirzin, ETHuskey, SEJacks, TSchleim, KDCheng, KSchaeffer, JMPatchett, AAYang, L Nipecotic and iso-nipecotic amides as potent and selective somatostatin subtype-2 receptor agonists. Bioorg Med Chem Lett11:415-7 (2001) Somatostatin receptor type 3
Name:Somatostatin receptor type 3
Type:Protein
Mol. Mass.:45855.97
Organism:Homo sapiens (Human)
Description:P32745
Residue:418
BDBM50096823
NameBDBM50096823
Synonyms:(S)-6-Amino-2-[(S)-2-[(1-benzoyl-piperidine-4-carbonyl)-amino]-3-(1H-indol-3-yl)-butyrylamino]-hexanoic acid tert-butyl ester | CHEMBL134280
TypeSmall organic molecule
Emp. Form.C35H47N5O5
Mol. Mass.617.7782
SMILESC[C@H](C(NC(=O)C1CCN(CC1)C(=O)c1ccccc1)C(=O)N[C@@H](CCCCN)C(=O)OC(C)(C)C)c1c[nH]c2ccccc12