Reaction Details
TargetEukaryotic initiation factor 4A-I
LigandBDBM50196926
Substrate/Competitorn/a
Meas. Tech.ChEMBL_1983225 (CHEMBL4616487)
IC50 47±n/a nM
Citation Ernst, JTThompson, PANilewski, CSprengeler, PASperry, SPackard, GMichels, TXiang, ATran, CWegerski, CJEam, BYoung, NPFish, SChen, JHoward, HStaunton, JMolter, JClarine, JNevarez, AChiang, GGAppleman, JRWebster, KRReich, SH Design of Development Candidate eFT226, a First in Class Inhibitor of Eukaryotic Initiation Factor 4A RNA Helicase. J Med Chem63:5879-5955 (2020) 
 
Eukaryotic initiation factor 4A-I
Name:Eukaryotic initiation factor 4A-I
Type:PROTEIN
Mol. Mass.:46146.87
Organism:Homo sapiens (Human)
Description:ChEMBL_864983
Residue:406
BDBM50196926
NameBDBM50196926
Synonyms:CHEMBL438139 US10085988, Compound (-) Roc-A
TypeSmall organic molecule
Emp. Form.C29H31NO7
Mol. Mass.505.5589
SMILESCOc1ccc(cc1)[C@@]12Oc3cc(OC)cc(OC)c3[C@]1(O)[C@H](O)[C@@H]([C@H]2c1ccccc1)C(=O)N(C)C