Reaction Details
TargetEukaryotic initiation factor 4A-I
LigandBDBM50540861
Substrate/Competitorn/a
Meas. Tech.ChEMBL_1983226 (CHEMBL4616488)
IC50 92±n/a nM
Citation Ernst, JTThompson, PANilewski, CSprengeler, PASperry, SPackard, GMichels, TXiang, ATran, CWegerski, CJEam, BYoung, NPFish, SChen, JHoward, HStaunton, JMolter, JClarine, JNevarez, AChiang, GGAppleman, JRWebster, KRReich, SH Design of Development Candidate eFT226, a First in Class Inhibitor of Eukaryotic Initiation Factor 4A RNA Helicase. J Med Chem63:5879-5955 (2020) 
 
Eukaryotic initiation factor 4A-I
Name:Eukaryotic initiation factor 4A-I
Type:PROTEIN
Mol. Mass.:46146.87
Organism:Homo sapiens (Human)
Description:ChEMBL_864983
Residue:406
BDBM50540861
NameBDBM50540861
Synonyms:EFT-226 Zotatifin
TypeSmall organic molecule
Emp. Form.C28H29N3O5
Mol. Mass.487.547
SMILESCOc1cc2O[C@]3([C@@H]([C@@H](CN(C)C)[C@@H](O)[C@@]3(O)c2c(OC)n1)c1ccccc1)c1ccc(cc1)C#N