Reaction Details
TargetProtein kinase C beta type
LigandBDBM50057510
Substrate/Competitorn/a
Meas. Tech.ChEBML_160628
Ki 442±n/a nM
Citation Nakagawa, YIrie, KNakamura, YOhigashi, H The amide hydrogen of (-)-indolactam-V and benzolactam-V8's plays a critical role in protein kinase C binding and tumor-promoting activities. Bioorg Med Chem Lett11:723-8 (2001) Protein kinase C beta type
Name:Protein kinase C beta type
Type:Enzyme
Mol. Mass.:76873.67
Organism:Homo sapiens (Human)
Description:The recombinant human PKC enzymes were produced using a baculovirus expression system in SF9 cells
Residue:671
BDBM50057510
NameBDBM50057510
Synonyms:(2S,5S)-8-Decyl-5-hydroxymethyl-2-isopropyl-1-methyl-1,4,5,6-tetrahydro-2H-benzo[e][1,4]diazocin-3-one | CHEMBL28205
TypeSmall organic molecule
Emp. Form.C25H42N2O2
Mol. Mass.402.6132
SMILESCCCCCCCCCCc1ccc2N(C)[C@@H](C(C)C)C(=O)N[C@H](CO)Cc2c1