Reaction Details
TargetProto-oncogene tyrosine-protein kinase Src
LigandBDBM50097956
Substrate/Competitorn/a
Meas. Tech.ChEMBL_221657 (CHEMBL823234)
IC50 1±n/a nM
Citation Widler, LGreen, JMissbach, MSusa, MAltmann, E 7-Alkyl- and 7-cycloalkyl-5-aryl-pyrrolo[2,3-d]pyrimidines--potent inhibitors of the tyrosine kinase c-Src. Bioorg Med Chem Lett11:849-52 (2001) Proto-oncogene tyrosine-protein kinase Src
Name:Proto-oncogene tyrosine-protein kinase Src
Type:Tyr protein kinase
Mol. Mass.:60015.36
Organism:Gallus gallus (Chicken)
Description:P00523
Residue:533
BDBM50097956
NameBDBM50097956
Synonyms:3-(4-Amino-7-cyclopentyl-7H-pyrrolo[2,3-d]pyrimidin-5-yl)-phenol CHEMBL169390
TypeSmall organic molecule
Emp. Form.C17H18N4O
Mol. Mass.294.351
SMILESNc1ncnc2n(cc(-c3cccc(O)c3)c12)C1CCCC1