Reaction Details
TargetTyrosine-protein kinase ABL1/ABL2
LigandBDBM50097971
Substrate/Competitorn/a
Meas. Tech.ChEMBL_226170 (CHEMBL847899)
IC50 56±n/a nM
Citation Altmann, EMissbach, MGreen, JSusa, MWagenknecht, HAWidler, L 7-Pyrrolidinyl- and 7-piperidinyl-5-aryl-pyrrolo[2,3-d]pyrimidines--potent inhibitors of the tyrosine kinase c-Src. Bioorg Med Chem Lett11:853-6 (2001) Tyrosine-protein kinase ABL1/ABL2
Name:Tyrosine-protein kinase ABL1/ABL2
Synonyms:Tyrosine-protein kinase ABL
Type:n/a
Mol. Mass.:n/a
Description:ASSAY_ID of EBI is 226000
Components:This complex has 2 components.
Component 1
Name:Tyrosine-protein kinase ABL1
Type:Enzyme
Mol. Mass.:122897.30
Organism:Homo sapiens (Human)
Description:P00519
Residue:1130
Component 2
Name:Tyrosine-protein kinase ABL2
Synonyms:ABL2 ABLL Abelson murine leukemia viral oncogene homolog 2 Tyrosine kinase ARG | VHL/Tyrosine-protein kinase ABL2
Type:PROTEIN
Mol. Mass.:128360.63
Organism:Homo sapiens (Human)
Description:ChEMBL_325082
Residue:1182
BDBM50097971
NameBDBM50097971
Synonyms:CHEMBL262276 {4-[4-Amino-5-(3-hydroxy-phenyl)-pyrrolo[2,3-d]pyrimidin-7-yl]-piperidin-1-yl}-acetic acid methyl ester
TypeSmall organic molecule
Emp. Form.C20H23N5O3
Mol. Mass.381.4283
SMILESCOC(=O)CN1CCC(CC1)n1cc(-c2cccc(O)c2)c2c(N)ncnc12