Reaction Details
TargetEpidermal growth factor receptor
LigandBDBM50097971
Substrate/Competitorn/a
Meas. Tech.ChEMBL_67046 (CHEMBL677884)
IC50>10000±n/a nM
Citation Altmann, EMissbach, MGreen, JSusa, MWagenknecht, HAWidler, L 7-Pyrrolidinyl- and 7-piperidinyl-5-aryl-pyrrolo[2,3-d]pyrimidines--potent inhibitors of the tyrosine kinase c-Src. Bioorg Med Chem Lett11:853-6 (2001) Epidermal growth factor receptor
Name:Epidermal growth factor receptor
Type:Receptor Kinase Domain
Mol. Mass.:134279.59
Organism:Homo sapiens (Human)
Description:P00533
Residue:1210
BDBM50097971
NameBDBM50097971
Synonyms:CHEMBL262276 {4-[4-Amino-5-(3-hydroxy-phenyl)-pyrrolo[2,3-d]pyrimidin-7-yl]-piperidin-1-yl}-acetic acid methyl ester
TypeSmall organic molecule
Emp. Form.C20H23N5O3
Mol. Mass.381.4283
SMILESCOC(=O)CN1CCC(CC1)n1cc(-c2cccc(O)c2)c2c(N)ncnc12