Reaction Details
Target5-hydroxytryptamine receptor 2C
LigandBDBM50098527
Substrate/Competitorn/a
Meas. Tech.ChEMBL_2822 (CHEMBL621508)
Ki 1.9±n/a nM
Citation Chambers, JJKurrasch-Orbaugh, DMParker, MANichols, DE Enantiospecific synthesis and pharmacological evaluation of a series of super-potent, conformationally restricted 5-HT(2A/2C) receptor agonists. J Med Chem44:1003-10 (2001) 5-hydroxytryptamine receptor 2C
Name:5-hydroxytryptamine receptor 2C
Type:Enzyme
Mol. Mass.:51935.10
Organism:Rattus norvegicus (Rat)
Description:P08909
Residue:460
BDBM50098527
NameBDBM50098527
Synonyms:1-Methyl-2-(8-trifluoromethyl-2,3,6,7-tetrahydro-benzo[1,2-b;4,5-b']difuran-4-yl)-ethyl-ammonium; chloride | CHEMBL6452
TypeSmall organic molecule
Emp. Form.C14H17F3NO2
Mol. Mass.288.2849
SMILESC[C@@H]([NH3+])Cc1c2CCOc2c(c2CCOc12)C(F)(F)F