Reaction Details
Target5-hydroxytryptamine receptor 2A
LigandBDBM50098536
Substrate/Competitorn/a
Meas. Tech.ChEMBL_2621 (CHEMBL621533)
Ki 0.32±n/a nM
Citation Chambers, JJKurrasch-Orbaugh, DMParker, MANichols, DE Enantiospecific synthesis and pharmacological evaluation of a series of super-potent, conformationally restricted 5-HT(2A/2C) receptor agonists. J Med Chem44:1003-10 (2001) 5-hydroxytryptamine receptor 2A
Name:5-hydroxytryptamine receptor 2A
Type:G Protein-Coupled Receptor (GPCR)
Mol. Mass.:52852.05
Organism:Rattus norvegicus (rat)
Description:Rat cortex membranes 5-HT2A receptors.
Residue:471
BDBM50098536
NameBDBM50098536
Synonyms:1-Methyl-2-(8-trifluoromethyl-benzo[1,2-b;4,5-b']difuran-4-yl)-ethyl-ammonium; chloride | CHEMBL6907
TypeSmall organic molecule
Emp. Form.C14H13F3NO2
Mol. Mass.284.2532
SMILESC[C@H]([NH3+])Cc1c2ccoc2c(c2ccoc12)C(F)(F)F