Reaction Details
TargetC-C chemokine receptor type 1
LigandBDBM50098627
Substrate/Competitorn/a
Meas. Tech.ChEMBL_218695 (CHEMBL821481)
IC50 240±n/a nM
Citation Naya, ASagara, YOhwaki, KSaeki, TIchikawa, DIwasawa, YNoguchi, KOhtake, N Design, synthesis, and discovery of a novel CCR1 antagonist. J Med Chem44:1429-35 (2001) C-C chemokine receptor type 1
Name:C-C chemokine receptor type 1
Type:PROTEIN
Mol. Mass.:40904.59
Organism:Mus musculus
Description:ChEMBL_1452291
Residue:355
BDBM50098627
NameBDBM50098627
Synonyms:1-Cyclooctylmethyl-4-[(2,7-dibromo-9H-xanthene-9-carbonyl)-amino]-1-methyl-piperidinium; iodide | CHEMBL33223
TypeSmall organic molecule
Emp. Form.C29H37Br2N2O2
Mol. Mass.605.424
SMILESC[N+]1(CC2CCCCCCC2)CCC(CC1)NC(=O)C1c2cc(Br)ccc2Oc2ccc(Br)cc12