Reaction Details
TargetC-C chemokine receptor type 1
LigandBDBM50098636
Substrate/Competitorn/a
Meas. Tech.ChEMBL_218695 (CHEMBL821481)
IC50 12±n/a nM
Citation Naya, ASagara, YOhwaki, KSaeki, TIchikawa, DIwasawa, YNoguchi, KOhtake, N Design, synthesis, and discovery of a novel CCR1 antagonist. J Med Chem44:1429-35 (2001) C-C chemokine receptor type 1
Name:C-C chemokine receptor type 1
Type:PROTEIN
Mol. Mass.:40904.59
Organism:Mus musculus
Description:ChEMBL_1452291
Residue:355
BDBM50098636
NameBDBM50098636
Synonyms:1-Cyclooct-1-enylmethyl-4-[(2,7-dibromo-9H-xanthencarrb0nyl)-amino]-1-ethyl-piperidinium; iodide | CHEMBL289902
TypeSmall organic molecule
Emp. Form.C30H37Br2N2O2
Mol. Mass.617.434
SMILESCC[N+]1(C\C2=C\CCCCCC2)CCC(CC1)NC(=O)C1c2cc(Br)ccc2Oc2ccc(Br)cc12