Reaction Details
TargetC-C chemokine receptor type 1
LigandBDBM50098638
Substrate/Competitorn/a
Meas. Tech.ChEMBL_220711 (CHEMBL843656)
IC50 1600±n/a nM
Citation Naya, ASagara, YOhwaki, KSaeki, TIchikawa, DIwasawa, YNoguchi, KOhtake, N Design, synthesis, and discovery of a novel CCR1 antagonist. J Med Chem44:1429-35 (2001) C-C chemokine receptor type 1
Name:C-C chemokine receptor type 1
Type:Enzyme
Mol. Mass.:41180.69
Organism:Homo sapiens (Human)
Description:P32246
Residue:355
BDBM50098638
NameBDBM50098638
Synonyms:CHEMBL33159 | N-(1-Cyclooctylmethyl-piperidin-4-yl)-2-hydroxy-2,2-diphenyl-acetamide
TypeSmall organic molecule
Emp. Form.C28H38N2O2
Mol. Mass.434.6135
SMILESOC(C(=O)NC1CCN(CC2CCCCCCC2)CC1)(c1ccccc1)c1ccccc1