Reaction Details
TargetC-C chemokine receptor type 1
LigandBDBM50098646
Substrate/Competitorn/a
Meas. Tech.ChEMBL_220711 (CHEMBL843656)
IC50>10000±n/a nM
Citation Naya, ASagara, YOhwaki, KSaeki, TIchikawa, DIwasawa, YNoguchi, KOhtake, N Design, synthesis, and discovery of a novel CCR1 antagonist. J Med Chem44:1429-35 (2001) C-C chemokine receptor type 1
Name:C-C chemokine receptor type 1
Type:Enzyme
Mol. Mass.:41180.69
Organism:Homo sapiens (Human)
Description:P32246
Residue:355
BDBM50098646
NameBDBM50098646
Synonyms:9H-Xanthene-9-carboxylic acid (1-benzyl-piperidin-4-yl)-amide | CHEMBL289464
TypeSmall organic molecule
Emp. Form.C26H26N2O2
Mol. Mass.398.4968
SMILESO=C(NC1CCN(Cc2ccccc2)CC1)C1c2ccccc2Oc2ccccc12