Reaction Details
TargetPeptide deformylase, mitochondrial
LigandBDBM50542140
Substrate/Competitorn/a
Meas. Tech.ChEMBL_1985989 (CHEMBL4619395)
IC50 11±n/a nM
Citation Hu, LCai, XDong, SZhen, YHu, JWang, SJiang, JHuang, JHan, YQian, YYuan, YHu, W Synthesis and Anticancer Activity of Novel Actinonin Derivatives as HsPDF Inhibitors. J Med Chem63:6959-6978 (2020) 
 
Peptide deformylase, mitochondrial
Name:Peptide deformylase, mitochondrial
Type:PROTEIN
Mol. Mass.:27023.25
Organism:Homo sapiens (Human)
Description:ChEMBL_154318
Residue:243
BDBM50542140
NameBDBM50542140
Synonyms:CHEMBL4636076
TypeSmall organic molecule
Emp. Form.C20H27FN4O4
Mol. Mass.406.4512
SMILESONC(=O)C[C@@H](CC1CCCC1)C(=O)N1CCC[C@H]1C(=O)Nc1ccc(F)cn1