Reaction Details
TargetPeptide deformylase, mitochondrial
LigandBDBM50542141
Substrate/Competitorn/a
Meas. Tech.ChEMBL_1985989 (CHEMBL4619395)
IC50 7.2±n/a nM
Citation Hu, LCai, XDong, SZhen, YHu, JWang, SJiang, JHuang, JHan, YQian, YYuan, YHu, W Synthesis and Anticancer Activity of Novel Actinonin Derivatives as HsPDF Inhibitors. J Med Chem63:6959-6978 (2020) 
 
Peptide deformylase, mitochondrial
Name:Peptide deformylase, mitochondrial
Type:PROTEIN
Mol. Mass.:27023.25
Organism:Homo sapiens (Human)
Description:ChEMBL_154318
Residue:243
BDBM50542141
NameBDBM50542141
Synonyms:CHEMBL4642360
TypeSmall organic molecule
Emp. Form.C21H27FN4O4
Mol. Mass.418.4619
SMILESONC(=O)C[C@@H](CC1CCCC1)C(=O)N1CC(=C)C[C@H]1C(=O)Nc1ccc(F)cn1